{"text_format":"1","workbook":"xlsx","n_sheets":2,"sheets":["Lookup_Table","Itemized Listing"],"not_rendered":{"charts":0,"images":5,"macros":0,"external_links":0,"defined_names":2,"comments":0,"pivot_tables":0},"unopened":[],"bounds":{"document_bytes":16777216,"sheet_cells":100000,"rows_first":2000,"rows_last":500,"rows_between":2000,"halvings":0,"cell_chars":16384,"cell_head_chars":4096},"cells_cut":0,"cells_raw":0,"read":"whole","date_system":"1900"}

{"sheet":"Lookup_Table","index":0,"n_rows":120,"n_cols":5,"rows_kept":120,"cut":false,"hidden":true,"merged":[]}
["Price","Item #","Table20.Brand","Table20.Description","Table20.Link"]
[111.6,7000,"Johnny's Selected Seeds","Moveable Caterpillar Tunnel Hoop Bender – 12'","https://www.johnnyseeds.com/tools-supplies/greenhouse-and-tunnel-supplies/benders/moveable-caterpillar-tunnel-hoop-bender-12-quick-hoops-7000.html"]
[94.5,7033,"Johnny's Selected Seeds","Sidewall Hand Crank","https://www.johnnyseeds.com/tools-supplies/greenhouse-and-tunnel-supplies/hardware-accessories/sidewall-hand-crank-7033.html"]
[9.4499999999999993,7035,"Johnny's Selected Seeds","Snap Clamps for 1-3/8 in. Top-Rail, 10 pack","https://www.johnnyseeds.com/tools-supplies/greenhouse-and-tunnel-supplies/hardware-accessories/snap-clamps-for-1%22-pvc-or-chain-link-fence-top-rail-7035.html"]
[24.51,181697,"Home Depot","10 ft length of 1-3/8\" top rail","https://www.homedepot.com/p/Everbilt-Chain-Link-Fence-1-3-8-in-Diameter-x-10-ft-Long-17-Gauge-Thick-Galvanized-Steel-Top-Rail-Post-328913DPTEB/312373065"]
[8.1,7036,"Johnny's Selected Seeds","Snap Clamps for 3/4\" PVC or 1\" EMT","https://www.johnnyseeds.com/tools-supplies/greenhouse-and-tunnel-supplies/hardware-accessories/snap-clamps-for-3-4%22-pvc-or-1%22-emt-7036.html"]
[31.97,623105,"Home Depot","8 ft length of 1-5/8 in. line post","https://www.homedepot.com/p/Everbilt-1-5-8-in-Dia-x-8-ft-16-Gauge-Galvanized-Steel-Chain-Link-Fence-Line-Post-328923DPTSEB/312373067"]
[2.5,7040,"Johnny's Selected Seeds","4 ft. length of Poly Latch (\"Wiggle\") Wire","https://www.johnnyseeds.com/tools-supplies/greenhouse-and-tunnel-supplies/hardware-accessories/poly-latch-wire-4-7040.html"]
[23.97,320858,"Home Depot","6 ft length of 1-5/8 in. line post","https://www.homedepot.com/p/Everbilt-1-5-8-in-Dia-x-6-ft-16-Gauge-Galvanized-Steel-Chain-Link-Fence-Line-Post-328921DPTSEB/312373050"]
[12.5,7041,"Johnny's Selected Seeds","8 ft. length of Poly Latch (\"Wiggle\") Channel","https://www.johnnyseeds.com/tools-supplies/greenhouse-and-tunnel-supplies/hardware-accessories/poly-latch-channel-8-7041.html"]
[247.5,7176,"Johnny's Selected Seeds","Tufflite IV Greenhouse Film, 28 x 65 ft.","https://www.johnnyseeds.com/tools-supplies/greenhouse-and-tunnel-supplies/greenhouse-film/tufflite/tufflite-iv-28-x-65-greenhouse-film-7176.html"]
[0.22,23,"www.boltdepot.com","Hex bolts, Zinc plated steel, 5/16\"-18 x 2\"","https://boltdepot.com/Product-Details?product=23"]
[305.10000000000002,7177,"Johnny's Selected Seeds","Tufflite IV Greenhouse Film, 28 x 100 ft.","https://www.johnnyseeds.com/tools-supplies/greenhouse-and-tunnel-supplies/greenhouse-film/tufflite/tufflite-iv-28-x-100-greenhouse-film-7177.html"]
[0.15,199,"www.boltdepot.com","1/4-20 x 2 in. hex head bolt","https://boltdepot.com/Product-Details?product=199"]
[350.1,7178,"Johnny's Selected Seeds","Tufflite IV Greenhouse Film, 28 x 125 ft.","https://www.johnnyseeds.com/tools-supplies/greenhouse-and-tunnel-supplies/greenhouse-film/tufflite/tufflite-iv-28-x-125-greenhouse-film-7178.html"]
[0.23,218,"www.boltdepot.com","Hex bolts, Zinc plated steel, 3/8\"-16 x 1\"","https://boltdepot.com/Product-Details?product=218"]
[193.5,7300,"Johnny's Selected Seeds","Gothic Tunnel Hoop Bender – 14'","https://www.johnnyseeds.com/tools-supplies/greenhouse-and-tunnel-supplies/benders/gothic-tunnel-hoop-bender-14-quick-hoops-7300.html"]
[1.21,859,"www.boltdepot.com","3/8 in. x 5 in. hex tap bolt (fully threaded)","https://boltdepot.com/Product-Details?product=859"]
[449.1,7301,"Johnny's Selected Seeds","Tufflite IV™ – 32' x 100'","https://www.johnnyseeds.com/tools-supplies/greenhouse-and-tunnel-supplies/greenhouse-film/tufflite/tufflite-iv-32-x-100-greenhouse-film-7301.html"]
[0.59,2032,"www.boltdepot.com","#10 x 4 in. wood screw","https://boltdepot.com/Product-Details?product=2032"]
[110.7,9018,"Johnny's Selected Seeds","Quick Hoops High Tunnel Bender","https://www.johnnyseeds.com/tools-supplies/greenhouse-and-tunnel-supplies/benders/high-tunnel-hoop-bender-12-quick-hoops-9018.html"]
[11.73,732050,"Home Depot","1 in. x 8 in. x 16 ft. ledger board ","https://www.homedepot.com/p/1-in-x-8-in-x-16-ft-Ledger-Common-Softwood-Boards-234611/202527794"]
[7.88,9150,"Johnny's Selected Seeds","Snap Clamps for ¾ in. EMT, 10 pack","https://www.johnnyseeds.com/tools-supplies/greenhouse-and-tunnel-supplies/hardware-accessories/snap-clamps-for-3-4%22-emt-or-1-2%22-pvc-9150.html"]
[7.0000000000000007E-2,2396,"www.boltdepot.com","Sheet metal screws, Self drilling, Hex washer head, Zinc plated steel, #6 x 1/2\"","https://boltdepot.com/Product-Details?product=2396"]
[34.65,9482,"Johnny's Selected Seeds","Ground Post Driver","https://www.johnnyseeds.com/tools-supplies/greenhouse-and-tunnel-supplies/hardware-accessories/ground-post-driver-9482.0.html"]
[5.17,2405,"www.boltdepot.com","#10 x 3/4 in. hex-head self-tapping screws, bag of 100","https://boltdepot.com/Product-Details?product=2405"]
[5.81,9542,"Johnny's Selected Seeds","Cross Connector for 1.315\" x 1.315\" Pipe, pkg of 2","https://www.johnnyseeds.com/tools-supplies/greenhouse-and-tunnel-supplies/hardware-accessories/cross-connectors-2-count-9542.html"]
[3.95,2520,"www.boltdepot.com","#8 x 3/4\" phillips-head self-tapping screws, bag of 100","https://boltdepot.com/Product-Details?product=2520"]
[35.1,9604,"Johnny's Selected Seeds","#9 Wire, Coil of 60 ft.","https://www.johnnyseeds.com/tools-supplies/row-covers-and-accessories/supports-anchors/coiled-%239-support-wire-60-9604.html"]
[0.12,2624,"www.boltdepot.com","1/4 -20 nylock lock nut","https://boltdepot.com/Product-Details?product=2624"]
[170.1,9630,"Johnny's Selected Seeds","Tufflite IV™ – 20' x 65'","https://www.johnnyseeds.com/tools-supplies/greenhouse-and-tunnel-supplies/greenhouse-film/tufflite/tufflite-iv-20-x-65-greenhouse-film-9630.html"]
[0.05,2648,"www.boltdepot.com","1/4 in. hex nut","https://boltdepot.com/Product-Details?product=2648"]
[310.5,9644,"Johnny's Selected Seeds","Tufflite IV™ – 20' x 125'","https://www.johnnyseeds.com/tools-supplies/greenhouse-and-tunnel-supplies/greenhouse-film/tufflite/tufflite-iv-20-x-125-greenhouse-film-9644.html"]
[197.1,9645,"Johnny's Selected Seeds","Tufflite IV Greenhouse Film, 24 x 65 ft.","https://www.johnnyseeds.com/tools-supplies/greenhouse-and-tunnel-supplies/greenhouse-film/tufflite/tufflite-iv-24-x-65-greenhouse-film-9645.html"]
[346.5,9701,"Johnny's Selected Seeds","Tufflite IV Greenhouse Film, 24 x 125 ft.","https://www.johnnyseeds.com/tools-supplies/greenhouse-and-tunnel-supplies/greenhouse-film/tufflite/tufflite-iv-24-x-125-greenhouse-film-9701.html"]
[71.55,9723,"Johnny's Selected Seeds","Anchoring Pins™ Fabric Staples – 500 Count","https://www.johnnyseeds.com/tools-supplies/row-covers-and-accessories/supports-anchors/anchoring-pins-fabric-staples-500-count-9723.html"]
[229,9724,"Johnny's Selected Seeds","Pro 5 Weed Barrier – 4' x 250'","https://www.johnnyseeds.com/tools-supplies/mulches-and-weed-barrier/fabric-mulch/pro-5-weed-barrier-4-x-250-landscape-fabric-9724.html"]
[114.3,9725,"Johnny's Selected Seeds","#9 Wire, Coil of 550 ft.","https://www.johnnyseeds.com/tools-supplies/row-covers-and-accessories/supports-anchors/coiled-%239-support-wire-550-9725.html"]
[7.0000000000000007E-2,2649,"www.boltdepot.com","5/16\"-18 hex nut","https://boltdepot.com/Product-Details?product=2649"]
[0.47,"BB138","Chain Link Fittings","1-3/8 in. brace band","https://chainlinkfittings.com/store/1-3-8-brace-bands-chain-link-fence.html"]
{"$rows_left_out":81}
{"sheet":"Itemized Listing","index":1,"n_rows":62,"n_cols":17,"rows_kept":62,"cut":false,"hidden":false,"merged":[[55,1,55,2],[56,1,56,2],[50,1,50,2],[51,1,51,2],[52,1,52,2],[53,1,53,2],[54,1,54,2],[41,1,41,2],[42,1,42,2],[43,1,43,2],[44,1,44,2],[45,1,45,2],[36,1,36,2],[37,1,37,2],[38,1,38,2],[39,1,39,2],[40,1,40,2],[31,1,31,2],[32,1,32,2],[33,1,33,2],[34,1,34,2],[35,1,35,2],[49,4,49,5],[47,4,47,5],[48,4,48,5],[44,4,44,5],[60,0,60,11],[50,4,50,5],[56,4,56,5],[55,4,55,5],[52,4,52,5],[54,4,54,5],[53,4,53,5],[51,4,51,5],[46,1,46,2],[47,1,47,2],[48,1,48,2],[49,1,49,2],[42,4,42,5],[41,4,41,5],[46,4,46,5],[40,4,40,5],[43,4,43,5],[45,4,45,5],[39,4,39,5],[32,4,32,5],[31,4,31,5],[26,4,26,5],[27,4,27,5],[28,4,28,5],[29,4,29,5],[30,4,30,5],[33,4,33,5],[34,4,34,5],[36,4,36,5],[38,4,38,5],[19,2,19,6],[18,2,18,6],[17,2,17,6],[14,2,14,6],[15,2,15,6],[21,2,21,6],[22,2,22,6],[25,1,25,2],[24,1,24,2],[25,4,25,5],[26,1,26,2],[27,1,27,2],[28,1,28,2],[29,1,29,2],[30,1,30,2],[61,0,61,11],[6,1,6,9],[37,4,37,5],[3,1,3,9],[7,1,7,5],[10,1,10,3],[12,1,12,3],[24,4,24,5],[11,1,11,3],[14,7,15,7],[21,7,22,7],[17,7,19,7],[4,1,4,9],[5,1,5,9],[13,1,13,3],[35,4,35,5]]}
[]
[]
[]
[null,"Quick Hoops™ 14 ft. Wide Modular Moveable 'Cathedral' Tunnel Calculator"]
[null,"***Fill in the items below and the calculator will do the rest.***"]
[null,"All prices are estimations. Prices will vary and do not include shipping costs or tax. Vendors and part#'s for pipe and other accessories are provided for your convenience only. Johnny's has no affiliation with these companies, other than purchasing these supplies from them and finding their prices competitive."]
[]
[null,"Dimensions, Spec's",null,null,null,null,null,null,"Square Feet",{"$f":"IFERROR(E12*E11,\"\")","v":""}]
[]
[null,"# Modules",null,null,null,{"$f":"IF(E10>0,\"\",\"Enter the # of modules here that you would like your tunnel to have.\")","v":"Enter the # of modules here that you would like your tunnel to have."},null,null,"Cost / Sq. Ft.",{"$f":"IFERROR(J58/J8,\"\")","v":""}]
[null,"Length",null,null,{"$f":"IF(OR(E10=\"\",E10=0),\"\",E10*16+E10-1)","v":""},"ft."]
[null,"Width",null,null,{"$f":"IF(OR(E10=\"\",E10=0),\"\",14)","v":""},"ft."]
[null,"Bow Spacing",null,null,{"$f":"IF(OR(E10=\"\",E10=0),\"\",\"5 ft. 4 in.\")","v":""}]
[null,"# Bows",null,null,{"$f":"IF(OR(E10=\"\",E10=0),\"\",4*E10)","v":""}]
[2,{"$f":"IF(A15=2,\"x\",\"\")","v":"x"},"Lower-cost 1\" EMT for Scissor Doors"]
[null,{"$f":"IF(A15=1,\"x\",\"\")","v":""},"Heavier-duty 1-3/8\" Top-Rail for Scissor Doors",null,null,null,null,null,null,null,null,null,null," "]
[]
[1,{"$f":"IF($A$18=1,\"x\",\"\")","v":"x"},"No roll-up sides at all"]
[null,{"$f":"IF($A$18=2,\"x\",\"\")","v":""},"Lower-cost manual roll-up sides"]
[null,{"$f":"IF($A$18=3,\"x\",\"\")","v":""},"Handcrank auto-stop roll-up sides"]
[]
[1,{"$f":"IF($A$22=1,\"x\",\"\")","v":"x"},"Lower-cost rebar anchors"]
[null,{"$f":"IF($A$22=2,\"x\",\"\")","v":""},"More secure earth auger anchors"]
[]
[null,"Qty",null,"Unit","Part#",null,"Vendor","Description","Price","Ext"]
[null,{"$f":"IF(E26=\"\",\"\",1)","v":""},null,{"$f":"IF($E26=\"\",\"\",\"each\")","v":""},{"$f":"IF($P26=\"\",\"\",HYPERLINK(_xlfn.XLOOKUP($P26,Lookup_Table!$B$2:$B$120,Lookup_Table!$E$2:$E$120),$P26))","v":""},null,{"$f":"IF(E26=\"\",\"\",_xlfn.XLOOKUP($E26,Lookup_Table[Item '#],Lookup_Table[Table20.Brand]))","v":""},{"$f":"IF($E26=\"\",\"\",CONCATENATE(_xlfn.XLOOKUP($E26,Lookup_Table[Item '#],Lookup_Table[Table20.Description]),$Q26))","v":""},{"$f":"IF(E26=\"\",\"\",_xlfn.XLOOKUP($E26,Lookup_Table[Item '#],Lookup_Table[Price]))","v":""},{"$f":"IF(I26=\"\",\"\",B26*I26)","v":""},null,null,null,null,null,{"$f":"IF(E10=\"\",\"\",7300)","v":""}]
[null,{"$f":"IF(E27=\"\",\"\",E14*2)","v":""},null,{"$f":"IF($E27=\"\",\"\",\"each\")","v":""},{"$f":"IF($P27=\"\",\"\",HYPERLINK(_xlfn.XLOOKUP($P27,Lookup_Table!$B$2:$B$120,Lookup_Table!$E$2:$E$120),$P27))","v":""},null,{"$f":"IF(E27=\"\",\"\",_xlfn.XLOOKUP($E27,Lookup_Table[Item '#],Lookup_Table[Table20.Brand]))","v":""},{"$f":"IF($E27=\"\",\"\",CONCATENATE(_xlfn.XLOOKUP($E27,Lookup_Table[Item '#],Lookup_Table[Table20.Description]),$Q27))","v":""},{"$f":"IF(E27=\"\",\"\",_xlfn.XLOOKUP($E27,Lookup_Table[Item '#],Lookup_Table[Price]))","v":""},"",null,null,null,null,null,{"$f":"IF($E$10=\"\",\"\",181697)","v":""}," for side hoops"]
[null,{"$f":"IF(E28=\"\",\"\",E14/2)","v":""},null,"",{"$f":"IF($P28=\"\",\"\",HYPERLINK(_xlfn.XLOOKUP($P28,Lookup_Table!$B$2:$B$120,Lookup_Table!$E$2:$E$120),$P28))","v":""},null,{"$f":"IF(E28=\"\",\"\",_xlfn.XLOOKUP($E28,Lookup_Table[Item '#],Lookup_Table[Table20.Brand]))","v":""},{"$f":"IF($E28=\"\",\"\",CONCATENATE(_xlfn.XLOOKUP($E28,Lookup_Table[Item '#],Lookup_Table[Table20.Description]),$Q28))","v":""},{"$f":"IF(E28=\"\",\"\",_xlfn.XLOOKUP($E28,Lookup_Table[Item '#],Lookup_Table[Price]))","v":""},"",null,null,null,null,null,{"$f":"IF($E$10=\"\",\"\",181697)","v":""}," for peak sections"]
[null,{"$f":"IF(E29=\"\",\"\",2*E10)","v":""},null,"",{"$f":"IF($P29=\"\",\"\",HYPERLINK(_xlfn.XLOOKUP($P29,Lookup_Table!$B$2:$B$120,Lookup_Table!$E$2:$E$120),$P29))","v":""},null,{"$f":"IF(E29=\"\",\"\",_xlfn.XLOOKUP($E29,Lookup_Table[Item '#],Lookup_Table[Table20.Brand]))","v":""},{"$f":"IF($E29=\"\",\"\",CONCATENATE(_xlfn.XLOOKUP($E29,Lookup_Table[Item '#],Lookup_Table[Table20.Description]),$Q29))","v":""},{"$f":"IF(E29=\"\",\"\",_xlfn.XLOOKUP($E29,Lookup_Table[Item '#],Lookup_Table[Price]))","v":""},"",null,null,null,null,null,{"$f":"IF($E$10=\"\",\"\",181697)","v":""},"f or ridge poles"]
[null,{"$f":"IF(E30=\"\",\"\",4*E10)","v":""},null,"",{"$f":"IF($P30=\"\",\"\",HYPERLINK(_xlfn.XLOOKUP($P30,Lookup_Table!$B$2:$B$120,Lookup_Table!$E$2:$E$120),$P30))","v":""},null,{"$f":"IF(E30=\"\",\"\",_xlfn.XLOOKUP($E30,Lookup_Table[Item '#],Lookup_Table[Table20.Brand]))","v":""},{"$f":"IF($E30=\"\",\"\",CONCATENATE(_xlfn.XLOOKUP($E30,Lookup_Table[Item '#],Lookup_Table[Table20.Description]),$Q30))","v":""},{"$f":"IF(E30=\"\",\"\",_xlfn.XLOOKUP($E30,Lookup_Table[Item '#],Lookup_Table[Price]))","v":""},"",null,null,null,null,null,{"$f":"IF($E$10=\"\",\"\",181697)","v":""}," for bottom rails"]
[null,{"$f":"IF(E31=\"\",\"\",3)","v":""},null,"",{"$f":"IF($P31=\"\",\"\",HYPERLINK(_xlfn.XLOOKUP($P31,Lookup_Table!$B$2:$B$120,Lookup_Table!$E$2:$E$120),$P31))","v":""},null,{"$f":"IF(E31=\"\",\"\",_xlfn.XLOOKUP($E31,Lookup_Table[Item '#],Lookup_Table[Table20.Brand]))","v":""},{"$f":"IF($E31=\"\",\"\",CONCATENATE(_xlfn.XLOOKUP($E31,Lookup_Table[Item '#],Lookup_Table[Table20.Description]),$Q31))","v":""},{"$f":"IF(E31=\"\",\"\",_xlfn.XLOOKUP($E31,Lookup_Table[Item '#],Lookup_Table[Price]))","v":""},"",null,null,null,null,null,{"$f":"IF($E$10=\"\",\"\",181697)","v":""}," for knee rails"]
[null,{"$f":"IF(E32=\"\",\"\",4)","v":""},null,"",{"$f":"IF($P32=\"\",\"\",HYPERLINK(_xlfn.XLOOKUP($P32,Lookup_Table!$B$2:$B$120,Lookup_Table!$E$2:$E$120),$P32))","v":""},null,{"$f":"IF(E32=\"\",\"\",_xlfn.XLOOKUP($E32,Lookup_Table[Item '#],Lookup_Table[Table20.Brand]))","v":""},{"$f":"IF($E32=\"\",\"\",CONCATENATE(_xlfn.XLOOKUP($E32,Lookup_Table[Item '#],Lookup_Table[Table20.Description]),$Q32))","v":""},{"$f":"IF(E32=\"\",\"\",_xlfn.XLOOKUP($E32,Lookup_Table[Item '#],Lookup_Table[Price]))","v":""},"",null,null,null,null,null,{"$f":"IF(E10=\"\",\"\",IF(AND(B15=\"X\",B16=\"\"),580015,IF(AND(B16=\"X\",B15=\"\"),181697,\"\")))","v":""}," for scissor doors"]
[null,{"$f":"IF(E33=\"\",\"\",4)","v":""},null,"",{"$f":"IF($P33=\"\",\"\",HYPERLINK(_xlfn.XLOOKUP($P33,Lookup_Table!$B$2:$B$120,Lookup_Table!$E$2:$E$120),$P33))","v":""},null,{"$f":"IF(E33=\"\",\"\",_xlfn.XLOOKUP($E33,Lookup_Table[Item '#],Lookup_Table[Table20.Brand]))","v":""},{"$f":"IF($E33=\"\",\"\",CONCATENATE(_xlfn.XLOOKUP($E33,Lookup_Table[Item '#],Lookup_Table[Table20.Description]),$Q33))","v":""},{"$f":"IF(E33=\"\",\"\",_xlfn.XLOOKUP($E33,Lookup_Table[Item '#],Lookup_Table[Price]))","v":""},"",null,null,null,null,null,{"$f":"IF(E10=\"\",\"\",IF(AND(B15=\"X\",B16=\"\"),7036,IF(AND(B16=\"X\",B15=\"\"),7035,\"\")))","v":""}," for 1 in. EMT, 10 pack"]
[null,{"$f":"IF(E34=\"\",\"\",E14)","v":""},null,"",{"$f":"IF($P34=\"\",\"\",HYPERLINK(_xlfn.XLOOKUP($P34,Lookup_Table!$B$2:$B$120,Lookup_Table!$E$2:$E$120),$P34))","v":""},null,{"$f":"IF(E34=\"\",\"\",_xlfn.XLOOKUP($E34,Lookup_Table[Item '#],Lookup_Table[Table20.Brand]))","v":""},{"$f":"IF($E34=\"\",\"\",CONCATENATE(_xlfn.XLOOKUP($E34,Lookup_Table[Item '#],Lookup_Table[Table20.Description]),$Q34))","v":""},{"$f":"IF(E34=\"\",\"\",_xlfn.XLOOKUP($E34,Lookup_Table[Item '#],Lookup_Table[Price]))","v":""},"",null,null,null,null,null,{"$f":"IF(E10=\"\",\"\",203114)","v":""}," for collar ties"]
[null,{"$f":"IF(E35=\"\",\"\",4)","v":""},null,"",{"$f":"IF($P35=\"\",\"\",HYPERLINK(_xlfn.XLOOKUP($P35,Lookup_Table!$B$2:$B$120,Lookup_Table!$E$2:$E$120),$P35))","v":""},null,{"$f":"IF(E35=\"\",\"\",_xlfn.XLOOKUP($E35,Lookup_Table[Item '#],Lookup_Table[Table20.Brand]))","v":""},{"$f":"IF($E35=\"\",\"\",CONCATENATE(_xlfn.XLOOKUP($E35,Lookup_Table[Item '#],Lookup_Table[Table20.Description]),$Q35))","v":""},{"$f":"IF(E35=\"\",\"\",_xlfn.XLOOKUP($E35,Lookup_Table[Item '#],Lookup_Table[Price]))","v":""},"",null,null,null,null,null,{"$f":"IF(E11=\"\",\"\",203114)","v":""}," for end wall angle braces"]
[null,{"$f":"IF(E36=\"\",\"\",IF(B18=\"x\",\"\",E11*2/10+2))","v":""},null,"",{"$f":"IF($P36=\"\",\"\",HYPERLINK(_xlfn.XLOOKUP($P36,Lookup_Table!$B$2:$B$120,Lookup_Table!$E$2:$E$120),$P36))","v":""},null,{"$f":"IF(E36=\"\",\"\",_xlfn.XLOOKUP($E36,Lookup_Table[Item '#],Lookup_Table[Table20.Brand]))","v":""},{"$f":"IF($E36=\"\",\"\",CONCATENATE(_xlfn.XLOOKUP($E36,Lookup_Table[Item '#],Lookup_Table[Table20.Description]),$Q36))","v":""},{"$f":"IF(E36=\"\",\"\",_xlfn.XLOOKUP($E36,Lookup_Table[Item '#],Lookup_Table[Price]))","v":""},{"$f":"IF(B36=\"\",\"\",B36*I36)","v":""},null,null,null,null,null,{"$f":"IF(E10=\"\",\"\",IF(B18=\"x\",\"\",203114))","v":""}," for roll-up sides"]
[null,{"$f":"IF(E37=\"\",\"\",IF(B36=\"\",\"\",ROUNDUP(B36/5,0)))","v":""},null,"",{"$f":"IF($P37=\"\",\"\",HYPERLINK(_xlfn.XLOOKUP($P37,Lookup_Table!$B$2:$B$120,Lookup_Table!$E$2:$E$120),$P37))","v":""},null,{"$f":"IF(E37=\"\",\"\",_xlfn.XLOOKUP($E37,Lookup_Table[Item '#],Lookup_Table[Table20.Brand]))","v":""},{"$f":"IF($E37=\"\",\"\",CONCATENATE(_xlfn.XLOOKUP($E37,Lookup_Table[Item '#],Lookup_Table[Table20.Description]),$Q37))","v":""},{"$f":"IF(E37=\"\",\"\",_xlfn.XLOOKUP($E37,Lookup_Table[Item '#],Lookup_Table[Price]))","v":""},{"$f":"IF(B37=\"\",\"\",B37*I37)","v":""},null,null,null,null,null,{"$f":"IF(E10=\"\",\"\",IF(B36=\"\",\"\",403636))","v":""}," for roll-ups, 5 pack"]
[null,{"$f":"IF(E38=\"\",\"\",IF(B18=\"x\",\"\",E10))","v":""},null,"",{"$f":"IF($P38=\"\",\"\",HYPERLINK(_xlfn.XLOOKUP($P38,Lookup_Table!$B$2:$B$120,Lookup_Table!$E$2:$E$120),$P38))","v":""},null,{"$f":"IF(E38=\"\",\"\",_xlfn.XLOOKUP($E38,Lookup_Table[Item '#],Lookup_Table[Table20.Brand]))","v":""},{"$f":"IF($E38=\"\",\"\",CONCATENATE(_xlfn.XLOOKUP($E38,Lookup_Table[Item '#],Lookup_Table[Table20.Description]),$Q38))","v":""},{"$f":"IF(E38=\"\",\"\",_xlfn.XLOOKUP($E38,Lookup_Table[Item '#],Lookup_Table[Price]))","v":""},{"$f":"IF(B38=\"\",\"\",B38*I38)","v":""},null,null,null,null,null,{"$f":"IF(E10=\"\",\"\",IF(B18=\"x\",\"\",9150))","v":""}," for ¾ in. EMT, 10 pack"]
[null,{"$f":"IF(E39=\"\",\"\",ROUNDUP(B40*2+25*(E10-1)/4,0))","v":""},null,"",{"$f":"IF($P39=\"\",\"\",HYPERLINK(_xlfn.XLOOKUP($P39,Lookup_Table!$B$2:$B$120,Lookup_Table!$E$2:$E$120),$P39))","v":""},null,{"$f":"IF(E39=\"\",\"\",_xlfn.XLOOKUP($E39,Lookup_Table[Item '#],Lookup_Table[Table20.Brand]))","v":""},{"$f":"IF($E39=\"\",\"\",CONCATENATE(_xlfn.XLOOKUP($E39,Lookup_Table[Item '#],Lookup_Table[Table20.Description]),$Q39))","v":""},{"$f":"IF(E39=\"\",\"\",_xlfn.XLOOKUP($E39,Lookup_Table[Item '#],Lookup_Table[Price]))","v":""},{"$f":"IF(I39=\"\",\"\",B39*I39)","v":""},null,null,"Bows","Knee Rails","Sides",{"$f":"IF(E10=\"\",\"\",7040)","v":""}]
[null,{"$f":"IF(E40=\"\",\"\",ROUNDUP((M40+N40+O40)/8,0))","v":""},null,"",{"$f":"IF($P40=\"\",\"\",HYPERLINK(_xlfn.XLOOKUP($P40,Lookup_Table!$B$2:$B$120,Lookup_Table!$E$2:$E$120),$P40))","v":""},null,{"$f":"IF(E40=\"\",\"\",_xlfn.XLOOKUP($E40,Lookup_Table[Item '#],Lookup_Table[Table20.Brand]))","v":""},{"$f":"IF($E40=\"\",\"\",CONCATENATE(_xlfn.XLOOKUP($E40,Lookup_Table[Item '#],Lookup_Table[Table20.Description]),$Q40))","v":""},{"$f":"IF(E40=\"\",\"\",_xlfn.XLOOKUP($E40,Lookup_Table[Item '#],Lookup_Table[Price]))","v":""},"",null,null,{"$f":"E10*25*2","v":0},{"$f":"15*2","v":30},{"$f":"E10*16*2","v":0},{"$f":"IF(E10=\"\",\"\",7041)","v":""}]
{"$rows_left_out":22}