{"text_format":"1","workbook":"xlsx","n_sheets":2,"sheets":["Lookup_Table","Itemized Listing"],"not_rendered":{"charts":0,"images":5,"macros":1,"external_links":0,"defined_names":4,"comments":1,"pivot_tables":0},"unopened":[],"bounds":{"document_bytes":16777216,"sheet_cells":100000,"rows_first":2000,"rows_last":500,"rows_between":2000,"halvings":0,"cell_chars":16384,"cell_head_chars":4096},"cells_cut":0,"cells_raw":0,"read":"whole","date_system":"1900"}

{"sheet":"Lookup_Table","index":0,"n_rows":120,"n_cols":5,"rows_kept":120,"cut":false,"hidden":true,"merged":[]}
["Price","Item #","Table20.Brand","Table20.Description","Table20.Link"]
[111.6,7000,"Johnny's Selected Seeds","Moveable Caterpillar Tunnel Hoop Bender – 12'","https://www.johnnyseeds.com/tools-supplies/greenhouse-and-tunnel-supplies/benders/moveable-caterpillar-tunnel-hoop-bender-12-quick-hoops-7000.html"]
[94.5,7033,"Johnny's Selected Seeds","Sidewall Hand Crank","https://www.johnnyseeds.com/tools-supplies/greenhouse-and-tunnel-supplies/hardware-accessories/sidewall-hand-crank-7033.html"]
[9.4499999999999993,7035,"Johnny's Selected Seeds","Snap Clamps for 1-3/8 in. Top-Rail, 10 pack","https://www.johnnyseeds.com/tools-supplies/greenhouse-and-tunnel-supplies/hardware-accessories/snap-clamps-for-1%22-pvc-or-chain-link-fence-top-rail-7035.html"]
[24.51,181697,"Home Depot","10 ft length of 1-3/8\" top rail","https://www.homedepot.com/p/Everbilt-Chain-Link-Fence-1-3-8-in-Diameter-x-10-ft-Long-17-Gauge-Thick-Galvanized-Steel-Top-Rail-Post-328913DPTEB/312373065"]
[8.1,7036,"Johnny's Selected Seeds","Snap Clamps for 3/4\" PVC or 1\" EMT","https://www.johnnyseeds.com/tools-supplies/greenhouse-and-tunnel-supplies/hardware-accessories/snap-clamps-for-3-4%22-pvc-or-1%22-emt-7036.html"]
[31.97,623105,"Home Depot","8 ft length of 1-5/8 in. line post","https://www.homedepot.com/p/Everbilt-1-5-8-in-Dia-x-8-ft-16-Gauge-Galvanized-Steel-Chain-Link-Fence-Line-Post-328923DPTSEB/312373067"]
[2.5,7040,"Johnny's Selected Seeds","4 ft. length of Poly Latch (\"Wiggle\") Wire","https://www.johnnyseeds.com/tools-supplies/greenhouse-and-tunnel-supplies/hardware-accessories/poly-latch-wire-4-7040.html"]
[23.97,320858,"Home Depot","6 ft length of 1-5/8 in. line post","https://www.homedepot.com/p/Everbilt-1-5-8-in-Dia-x-6-ft-16-Gauge-Galvanized-Steel-Chain-Link-Fence-Line-Post-328921DPTSEB/312373050"]
[12.5,7041,"Johnny's Selected Seeds","8 ft. length of Poly Latch (\"Wiggle\") Channel","https://www.johnnyseeds.com/tools-supplies/greenhouse-and-tunnel-supplies/hardware-accessories/poly-latch-channel-8-7041.html"]
[247.5,7176,"Johnny's Selected Seeds","Tufflite IV Greenhouse Film, 28 x 65 ft.","https://www.johnnyseeds.com/tools-supplies/greenhouse-and-tunnel-supplies/greenhouse-film/tufflite/tufflite-iv-28-x-65-greenhouse-film-7176.html"]
[0.22,23,"www.boltdepot.com","Hex bolts, Zinc plated steel, 5/16\"-18 x 2\"","https://boltdepot.com/Product-Details?product=23"]
[305.10000000000002,7177,"Johnny's Selected Seeds","Tufflite IV Greenhouse Film, 28 x 100 ft.","https://www.johnnyseeds.com/tools-supplies/greenhouse-and-tunnel-supplies/greenhouse-film/tufflite/tufflite-iv-28-x-100-greenhouse-film-7177.html"]
[0.15,199,"www.boltdepot.com","1/4-20 x 2 in. hex head bolt","https://boltdepot.com/Product-Details?product=199"]
[350.1,7178,"Johnny's Selected Seeds","Tufflite IV Greenhouse Film, 28 x 125 ft.","https://www.johnnyseeds.com/tools-supplies/greenhouse-and-tunnel-supplies/greenhouse-film/tufflite/tufflite-iv-28-x-125-greenhouse-film-7178.html"]
[0.23,218,"www.boltdepot.com","Hex bolts, Zinc plated steel, 3/8\"-16 x 1\"","https://boltdepot.com/Product-Details?product=218"]
[193.5,7300,"Johnny's Selected Seeds","Gothic Tunnel Hoop Bender – 14'","https://www.johnnyseeds.com/tools-supplies/greenhouse-and-tunnel-supplies/benders/gothic-tunnel-hoop-bender-14-quick-hoops-7300.html"]
[1.21,859,"www.boltdepot.com","3/8 in. x 5 in. hex tap bolt (fully threaded)","https://boltdepot.com/Product-Details?product=859"]
[449.1,7301,"Johnny's Selected Seeds","Tufflite IV™ – 32' x 100'","https://www.johnnyseeds.com/tools-supplies/greenhouse-and-tunnel-supplies/greenhouse-film/tufflite/tufflite-iv-32-x-100-greenhouse-film-7301.html"]
[0.59,2032,"www.boltdepot.com","#10 x 4 in. wood screw","https://boltdepot.com/Product-Details?product=2032"]
[110.7,9018,"Johnny's Selected Seeds","Quick Hoops High Tunnel Bender","https://www.johnnyseeds.com/tools-supplies/greenhouse-and-tunnel-supplies/benders/high-tunnel-hoop-bender-12-quick-hoops-9018.html"]
[11.73,732050,"Home Depot","1 in. x 8 in. x 16 ft. ledger board ","https://www.homedepot.com/p/1-in-x-8-in-x-16-ft-Ledger-Common-Softwood-Boards-234611/202527794"]
[7.88,9150,"Johnny's Selected Seeds","Snap Clamps for ¾ in. EMT, 10 pack","https://www.johnnyseeds.com/tools-supplies/greenhouse-and-tunnel-supplies/hardware-accessories/snap-clamps-for-3-4%22-emt-or-1-2%22-pvc-9150.html"]
[7.0000000000000007E-2,2396,"www.boltdepot.com","Sheet metal screws, Self drilling, Hex washer head, Zinc plated steel, #6 x 1/2\"","https://boltdepot.com/Product-Details?product=2396"]
[34.65,9482,"Johnny's Selected Seeds","Ground Post Driver","https://www.johnnyseeds.com/tools-supplies/greenhouse-and-tunnel-supplies/hardware-accessories/ground-post-driver-9482.0.html"]
[5.17,2405,"www.boltdepot.com","#10 x 3/4 in. hex-head self-tapping screws, bag of 100","https://boltdepot.com/Product-Details?product=2405"]
[5.81,9542,"Johnny's Selected Seeds","Cross Connector for 1.315\" x 1.315\" Pipe, pkg of 2","https://www.johnnyseeds.com/tools-supplies/greenhouse-and-tunnel-supplies/hardware-accessories/cross-connectors-2-count-9542.html"]
[3.95,2520,"www.boltdepot.com","#8 x 3/4\" phillips-head self-tapping screws, bag of 100","https://boltdepot.com/Product-Details?product=2520"]
[35.1,9604,"Johnny's Selected Seeds","#9 Wire, Coil of 60 ft.","https://www.johnnyseeds.com/tools-supplies/row-covers-and-accessories/supports-anchors/coiled-%239-support-wire-60-9604.html"]
[0.12,2624,"www.boltdepot.com","1/4 -20 nylock lock nut","https://boltdepot.com/Product-Details?product=2624"]
[170.1,9630,"Johnny's Selected Seeds","Tufflite IV™ – 20' x 65'","https://www.johnnyseeds.com/tools-supplies/greenhouse-and-tunnel-supplies/greenhouse-film/tufflite/tufflite-iv-20-x-65-greenhouse-film-9630.html"]
[0.05,2648,"www.boltdepot.com","1/4 in. hex nut","https://boltdepot.com/Product-Details?product=2648"]
[310.5,9644,"Johnny's Selected Seeds","Tufflite IV™ – 20' x 125'","https://www.johnnyseeds.com/tools-supplies/greenhouse-and-tunnel-supplies/greenhouse-film/tufflite/tufflite-iv-20-x-125-greenhouse-film-9644.html"]
[197.1,9645,"Johnny's Selected Seeds","Tufflite IV Greenhouse Film, 24 x 65 ft.","https://www.johnnyseeds.com/tools-supplies/greenhouse-and-tunnel-supplies/greenhouse-film/tufflite/tufflite-iv-24-x-65-greenhouse-film-9645.html"]
[346.5,9701,"Johnny's Selected Seeds","Tufflite IV Greenhouse Film, 24 x 125 ft.","https://www.johnnyseeds.com/tools-supplies/greenhouse-and-tunnel-supplies/greenhouse-film/tufflite/tufflite-iv-24-x-125-greenhouse-film-9701.html"]
[71.55,9723,"Johnny's Selected Seeds","Anchoring Pins™ Fabric Staples – 500 Count","https://www.johnnyseeds.com/tools-supplies/row-covers-and-accessories/supports-anchors/anchoring-pins-fabric-staples-500-count-9723.html"]
[229,9724,"Johnny's Selected Seeds","Pro 5 Weed Barrier – 4' x 250'","https://www.johnnyseeds.com/tools-supplies/mulches-and-weed-barrier/fabric-mulch/pro-5-weed-barrier-4-x-250-landscape-fabric-9724.html"]
[114.3,9725,"Johnny's Selected Seeds","#9 Wire, Coil of 550 ft.","https://www.johnnyseeds.com/tools-supplies/row-covers-and-accessories/supports-anchors/coiled-%239-support-wire-550-9725.html"]
[7.0000000000000007E-2,2649,"www.boltdepot.com","5/16\"-18 hex nut","https://boltdepot.com/Product-Details?product=2649"]
[0.47,"BB138","Chain Link Fittings","1-3/8 in. brace band","https://chainlinkfittings.com/store/1-3-8-brace-bands-chain-link-fence.html"]
{"$rows_left_out":81}
{"sheet":"Itemized Listing","index":1,"n_rows":113,"n_cols":23,"rows_kept":113,"cut":false,"hidden":false,"merged":[[18,3,18,8],[17,3,17,8],[111,3,111,11],[68,3,68,4],[67,3,67,4],[66,3,66,4],[65,3,65,4],[64,3,64,4],[63,3,63,4],[62,3,62,4],[61,3,61,4],[60,3,60,4],[76,6,76,7],[77,6,77,7],[38,6,38,7],[40,6,40,7],[39,6,39,7],[63,6,63,7],[70,6,70,7],[61,6,61,7],[62,6,62,7],[57,6,57,7],[99,6,99,7],[105,6,105,7],[13,1,18,1],[33,6,33,7],[48,6,48,7],[50,6,50,7],[34,6,34,7],[42,6,42,7],[45,6,45,7],[37,6,37,7],[31,6,31,7],[35,3,35,4],[34,3,34,4],[33,3,33,4],[32,3,32,4],[31,3,31,4],[30,3,30,4],[29,3,29,4],[27,3,27,4],[26,3,26,4],[40,3,40,4],[39,3,39,4],[38,3,38,4],[37,3,37,4],[21,3,21,8],[20,3,20,8],[95,6,95,7],[86,6,86,7],[93,6,93,7],[59,9,59,10],[102,9,102,10],[25,9,25,10],[28,3,28,8],[28,9,28,10],[52,3,52,8],[36,6,36,7],[51,6,51,7],[32,6,32,7],[56,6,56,7],[96,6,96,7],[73,3,73,8],[73,9,73,10],[44,6,44,7],[74,6,74,7],[29,6,29,7],[54,6,54,7],[87,6,87,7],[92,6,92,7],[89,6,89,7],[90,6,90,7],[107,6,107,7],[108,6,108,7],[59,3,59,8],[72,6,72,7],[66,6,66,7],[64,6,64,7],[100,6,100,7],[101,6,101,7],[60,6,60,7],[65,6,65,7],[102,3,102,8],[103,6,103,7],[104,6,104,7],[75,6,75,7],[67,6,67,7],[94,6,94,7],[82,6,82,7],[98,6,98,7],[97,6,97,7],[68,6,68,7],[69,6,69,7],[106,6,106,7],[78,6,78,7],[79,6,79,7],[20,9,21,11],[58,6,58,7],[49,6,49,7],[46,3,46,8],[46,9,46,10],[1,3,1,11],[7,3,7,5],[24,6,24,7],[30,6,30,7],[17,9,18,11],[2,3,2,11],[5,3,5,7],[10,3,10,5],[10,8,10,11],[10,6,10,7],[11,3,11,5],[8,3,8,5],[47,6,47,7],[43,6,43,7],[27,6,27,7],[25,3,25,8],[26,6,26,7],[35,6,35,7],[52,9,52,10],[91,6,91,7],[55,6,55,7],[41,9,41,10],[83,6,83,7],[88,6,88,7],[84,6,84,7],[85,6,85,7],[41,3,41,8],[80,6,80,7],[81,6,81,7],[71,6,71,7],[53,6,53,7],[58,3,58,4],[57,3,57,4],[56,3,56,4],[55,3,55,4],[54,3,54,4],[53,3,53,4],[72,3,72,4],[71,3,71,4],[70,3,70,4],[69,3,69,4],[82,3,82,4],[81,3,81,4],[36,3,36,4],[45,3,45,4],[44,3,44,4],[43,3,43,4],[42,3,42,4],[51,3,51,4],[50,3,50,4],[49,3,49,4],[48,3,48,4],[47,3,47,4],[77,3,77,4],[76,3,76,4],[75,3,75,4],[74,3,74,4],[83,3,83,4],[100,3,100,4],[99,3,99,4],[98,3,98,4],[97,3,97,4],[96,3,96,4],[95,3,95,4],[94,3,94,4],[93,3,93,4],[92,3,92,4],[112,3,112,11],[14,3,14,4],[13,3,13,4],[101,3,101,4],[13,9,15,9],[24,3,24,4],[3,3,3,11],[108,3,108,4],[107,3,107,4],[106,3,106,4],[105,3,105,4],[104,3,104,4],[103,3,103,4],[91,3,91,4],[90,3,90,4],[89,3,89,4],[88,3,88,4],[87,3,87,4],[86,3,86,4],[85,3,85,4],[84,3,84,4],[80,3,80,4],[79,3,79,4],[78,3,78,4]]}
[]
[null,null,null,"Quick Hoops™ Fixed Traditional 14 ft. Wide Gothic High Tunnel Calculator"]
[null,null,null,"***Change the items in white boxes below to meet your needs and the calculator will do the rest.***"]
[null,null,null,"All prices are estimations. Prices will vary and do not include shipping costs or tax. Vendors and part#'s for pipe and other accessories are provided for your convenience only. Johnny's has no affiliation with these companies, other than purchasing these supplies from them and finding their prices competitive."]
[]
[null,null,null,"Dimensions, Spec's",null,null,null,null,null,null,"Square Feet",{"$f":"14*G8","v":0}]
[]
[null,null,null,"Length",null,null,null,"feet","Enter length here. Must be divisible by spacing. ",null,"Cost / Sq. Ft.",{"$f":"IF(OR($G$8=\"\",G8=0),\"\",L110/L6)","v":""},null,null,null,null,null,{"$f":"_xlfn._xlws.FILTER(_xlfn.SEQUENCE(3,,4),MOD($G$8/_xlfn.SEQUENCE(3,,4),1)=0=TRUE,\"Length must be divisable by 4,5 or 6\")","v":4}]
[null,null,null,"Spacing",null,null,null,"feet",null,null,null,null,null,null,null,null,null,5]
[null,null,null,null,null,null,null,null,null,null,null,null,null,null,null,null,null,6]
[null,null,null,"# Segments",null,null,{"$f":"IF(OR($G$8=\"\",$G$8=0,$G$9=\"\",$G$9=0),\"\",G8/G9)","v":""}]
[null,"Condition",null,"# Bows",null,null,{"$f":"IF(OR($G$8=\"\",$G$8=0,$G$9=\"\",$G$9=0),\"\",G11+1)","v":""}]
[]
[null,{"$f":"IF(A16=TRUE,4,IF(AND(D14=2,D15=\"\",A16=FALSE, D18=\"x\",D19=\"\"),1,IF(AND(D14=1,D15=1,A16=FALSE, D18=\"x\",D19=\"\"),2,IF(AND(D14=\"\",D15=2,A16=FALSE, D18=\"x\",D19=\"\"),3,IF(AND(D14=\"\",D15=\"\",A16=FALSE, D18=\"\",D19=\"x\"),1,IF(AND(D14=2,D15=\"\",A16=FALSE, D18=\"\",D19=\"x\"),5,IF(AND(D14=1,D15=1,A16=FALSE, D18=\"\",D19=\"x\"),6,7)))))))","v":7},null,null,null," # Low cost scissor doors",null,null,null,{"$f":"IF(AND(D14=\"\", D15=\"\", D16=\"x\"),\"\", IF(AND((D14+D15)=2,D16=\"\"),\"\", \"Select '1' or '2' from the drop-down next to your choice for End Wall Options. You may choose 1 of each kind, 2 of one kind or the other, or select No end walls, and the calculator will not calculate them.\"))","v":"Select '1' or '2' from the drop-down next to your choice for End Wall Options. You may choose 1 of each kind, 2 of one kind or the other, or select No end walls, and the calculator will not calculate them."},null,null,null,null,null,null,null,{"$f":"2-SUM(D14:E15)","v":2},{"$f":"IFERROR(_xlfn._xlws.FILTER(_xlfn.SEQUENCE(2),_xlfn.SEQUENCE(2)<=$R$14),\"Plese select up to 2 doors options total\")","v":1}]
[null,null,null,null,null," # End walls with doors (per our instructions)",null,null,null,null,null,null,null,null,null," ",null,null,2]
[false,null,null,null,null," No end walls (do not calculate them)"]
[]
[1,null,null,{"$f":"IF($A$18=1,\"x\",\"\")","v":"x"},null,null,null,null,null,{"$f":"IF(AND(D18=\"x\",D19=\"\"),\"\",IF(AND(D18=\"\",D19=\"x\"),\"\", \"Type 'X' next to your choice for Roll-up Sides.               Please make only one choice.\"))","v":""},null,null,null,null,null,null,null,{"$f":"IF($A$16=TRUE,TRUE,FALSE)","v":false}]
[null,null,null,{"$f":"IF($A$18=2,\"x\",\"\")","v":""}]
[]
[1,null,null,{"$f":"IF($A$21=1,\"x\",\"\")","v":"x"},null,null,null,null,null,{"$f":"IF(AND(D21=\"x\",D22=\"\"),\"\",IF(AND(D21=\"\",D22=\"x\"),\"\", \"Type 'X' next to your choice for Weed Barrier.               Please make only one choice.\"))","v":""}]
[null,null,null,{"$f":"IF($A$21=2,\"x\",\"\")","v":""}]
[]
[]
[null,null,null,"Qty",null,"Unit","Part#",null,"Vendor","Description","Price","Ext"]
[null,null,null,"Special Tools",null,null,null,null,null,"Subtotal:",null,{"$f":"SUM(L27:L28)","v":0}]
[null,null,null,{"$f":"IF($G27=\"\",\"\",1)","v":""},null,{"$f":"IF($G27=\"\",\"\",\"each\")","v":""},{"$f":"IF($R27=\"\",\"\",HYPERLINK(_xlfn.XLOOKUP($R27,Lookup_Table!B:B,Lookup_Table!E:E),$R27))","v":""},null,{"$f":"IF($G27=\"\",\"\",_xlfn.XLOOKUP($G27,Lookup_Table!$B:$B,Lookup_Table!C:C))","v":""},{"$f":"IF($G27=\"\",\"\",CONCATENATE(_xlfn.XLOOKUP($G27,Lookup_Table!$B:$B,Lookup_Table!D:D),\" \",$S27))","v":""},{"$f":"IF($G27=\"\",\"\",_xlfn.XLOOKUP($G27,Lookup_Table!$B:$B,Lookup_Table!$A:$A))","v":""},{"$f":"IF($G27=\"\",\"\",$D27*$K27)","v":""},null,null,null,null,null,{"$f":"IF(OR($G$8=\"\",$G$8=0,$G$9=\"\",$G$9=0),\"\",7300)","v":""},""]
[null,null,null,{"$f":"IF($G28=\"\",\"\",1)","v":""},null,{"$f":"IF($G28=\"\",\"\",\"each\")","v":""},{"$f":"IF($R28=\"\",\"\",HYPERLINK(_xlfn.XLOOKUP($R28,Lookup_Table!B:B,Lookup_Table!E:E),$R28))","v":""},null,{"$f":"IF($G28=\"\",\"\",_xlfn.XLOOKUP($G28,Lookup_Table!$B:$B,Lookup_Table!C:C))","v":""},{"$f":"IF($G28=\"\",\"\",CONCATENATE(_xlfn.XLOOKUP($G28,Lookup_Table!$B:$B,Lookup_Table!D:D),\" \",$S28))","v":""},{"$f":"IF($G28=\"\",\"\",_xlfn.XLOOKUP($G28,Lookup_Table!$B:$B,Lookup_Table!$A:$A))","v":""},{"$f":"IF($G28=\"\",\"\",$D28*$K28)","v":""},null,null,null,null,null,{"$f":"IF(OR($G$8=\"\",$G$8=0,$G$9=\"\",$G$9=0),\"\",9482)","v":""},""]
[null,null,null,"Frame Components",null,null,null,null,null,"Subtotal:",null,{"$f":"SUM(L30:L41)","v":0},null,null,null,null,null,null,""]
[null,null,null,{"$f":"IF($G30=\"\",\"\",G12*2)","v":""},null,{"$f":"IF($G30=\"\",\"\",\"each\")","v":""},{"$f":"IF($R30=\"\",\"\",HYPERLINK(_xlfn.XLOOKUP($R30,Lookup_Table!B:B,Lookup_Table!E:E),$R30))","v":""},null,{"$f":"IF($G30=\"\",\"\",_xlfn.XLOOKUP($G30,Lookup_Table!$B:$B,Lookup_Table!C:C))","v":""},{"$f":"IF($G30=\"\",\"\",CONCATENATE(_xlfn.XLOOKUP($G30,Lookup_Table!$B:$B,Lookup_Table!D:D),\" \",$S30))","v":""},{"$f":"IF($G30=\"\",\"\",_xlfn.XLOOKUP($G30,Lookup_Table!$B:$B,Lookup_Table!$A:$A))","v":""},{"$f":"IF($G30=\"\",\"\",$D30*$K30)","v":""},null,null,null,null,null,{"$f":"IF(OR($G$8=\"\",$G$8=0,$G$9=\"\",$G$9=0),\"\",181697)","v":""},"for side hoops"]
[null,null,null,{"$f":"IF($G31=\"\",\"\",ROUNDUP(G12/2,0))","v":""},null,"",{"$f":"IF($R31=\"\",\"\",HYPERLINK(_xlfn.XLOOKUP($R31,Lookup_Table!B:B,Lookup_Table!E:E),$R31))","v":""},null,{"$f":"IF($G31=\"\",\"\",_xlfn.XLOOKUP($G31,Lookup_Table!$B:$B,Lookup_Table!C:C))","v":""},{"$f":"IF($G31=\"\",\"\",CONCATENATE(_xlfn.XLOOKUP($G31,Lookup_Table!$B:$B,Lookup_Table!D:D),\" \",$S31))","v":""},{"$f":"IF($G31=\"\",\"\",_xlfn.XLOOKUP($G31,Lookup_Table!$B:$B,Lookup_Table!$A:$A))","v":""},"",null,null,null,null,null,{"$f":"IF(OR($G$8=\"\",$G$8=0,$G$9=\"\",$G$9=0),\"\",181697)","v":""},"for peak sections"]
[null,null,null,{"$f":"IF($G32=\"\",\"\",IF($A$16=TRUE,ROUNDUP(G8/10,0),IF(D14>0,ROUNDUP(G8/10+0.5,0),ROUNDUP(G8/10,0))))","v":""},null,"",{"$f":"IF($R32=\"\",\"\",HYPERLINK(_xlfn.XLOOKUP($R32,Lookup_Table!B:B,Lookup_Table!E:E),$R32))","v":""},null,{"$f":"IF($G32=\"\",\"\",_xlfn.XLOOKUP($G32,Lookup_Table!$B:$B,Lookup_Table!C:C))","v":""},{"$f":"IF($G32=\"\",\"\",CONCATENATE(_xlfn.XLOOKUP($G32,Lookup_Table!$B:$B,Lookup_Table!D:D),\" \",$S32))","v":""},{"$f":"IF($G32=\"\",\"\",_xlfn.XLOOKUP($G32,Lookup_Table!$B:$B,Lookup_Table!$A:$A))","v":""},"",null,null,null,null,null,{"$f":"IF(OR($G$8=\"\",$G$8=0,$G$9=\"\",$G$9=0),\"\",181697)","v":""},"for ridge pole"]
[null,null,null,{"$f":"IF($G33=\"\",\"\",4)","v":""},null,"",{"$f":"IF($R33=\"\",\"\",HYPERLINK(_xlfn.XLOOKUP($R33,Lookup_Table!B:B,Lookup_Table!E:E),$R33))","v":""},null,{"$f":"IF($G33=\"\",\"\",_xlfn.XLOOKUP($G33,Lookup_Table!$B:$B,Lookup_Table!C:C))","v":""},{"$f":"IF($G33=\"\",\"\",CONCATENATE(_xlfn.XLOOKUP($G33,Lookup_Table!$B:$B,Lookup_Table!D:D),\" \",$S33))","v":""},{"$f":"IF($G33=\"\",\"\",_xlfn.XLOOKUP($G33,Lookup_Table!$B:$B,Lookup_Table!$A:$A))","v":""},"",null,null,null,null,null,{"$f":"IF(OR($G$8=\"\",$G$8=0,$G$9=\"\",$G$9=0),\"\",181697)","v":""},"for angle braces"]
[null,null,null,{"$f":"IF($G34=\"\",\"\",G12)","v":""},null,"",{"$f":"IF($R34=\"\",\"\",HYPERLINK(_xlfn.XLOOKUP($R34,Lookup_Table!B:B,Lookup_Table!E:E),$R34))","v":""},null,{"$f":"IF($G34=\"\",\"\",_xlfn.XLOOKUP($G34,Lookup_Table!$B:$B,Lookup_Table!C:C))","v":""},{"$f":"IF($G34=\"\",\"\",CONCATENATE(_xlfn.XLOOKUP($G34,Lookup_Table!$B:$B,Lookup_Table!D:D),\" \",$S34))","v":""},{"$f":"IF($G34=\"\",\"\",_xlfn.XLOOKUP($G34,Lookup_Table!$B:$B,Lookup_Table!$A:$A))","v":""},"",null,null,null,null,null,{"$f":"IF(OR($G$8=\"\",$G$8=0,$G$9=\"\",$G$9=0),\"\",623105)","v":""},"for ground posts"]
[null,null,null,{"$f":"IF($G35=\"\",\"\",G12)","v":""},null,"",{"$f":"IF($R35=\"\",\"\",HYPERLINK(_xlfn.XLOOKUP($R35,Lookup_Table!B:B,Lookup_Table!E:E),$R35))","v":""},null,{"$f":"IF($G35=\"\",\"\",_xlfn.XLOOKUP($G35,Lookup_Table!$B:$B,Lookup_Table!C:C))","v":""},{"$f":"IF($G35=\"\",\"\",CONCATENATE(_xlfn.XLOOKUP($G35,Lookup_Table!$B:$B,Lookup_Table!D:D),\" \",$S35))","v":""},{"$f":"IF($G35=\"\",\"\",_xlfn.XLOOKUP($G35,Lookup_Table!$B:$B,Lookup_Table!$A:$A))","v":""},"",null,null,null,null,null,{"$f":"IF(OR($G$8=\"\",$G$8=0,$G$9=\"\",$G$9=0),\"\",203114)","v":""},"for collar ties"]
[null,null,null,{"$f":"IF($G36=\"\",\"\",G12*2)","v":""},null,"",{"$f":"IF($R36=\"\",\"\",HYPERLINK(_xlfn.XLOOKUP($R36,Lookup_Table!B:B,Lookup_Table!E:E),$R36))","v":""},null,{"$f":"IF($G36=\"\",\"\",_xlfn.XLOOKUP($G36,Lookup_Table!$B:$B,Lookup_Table!C:C))","v":""},{"$f":"IF($G36=\"\",\"\",CONCATENATE(_xlfn.XLOOKUP($G36,Lookup_Table!$B:$B,Lookup_Table!D:D),\" \",$S36))","v":""},{"$f":"IF($G36=\"\",\"\",_xlfn.XLOOKUP($G36,Lookup_Table!$B:$B,Lookup_Table!$A:$A))","v":""},"",null,null,null,null,null,{"$f":"IF(OR($G$8=\"\",$G$8=0,$G$9=\"\",$G$9=0),\"\",23)","v":""},"for ground posts"]
[null,null,null,{"$f":"IF($G37=\"\",\"\",D36)","v":""},null,"",{"$f":"IF($R37=\"\",\"\",HYPERLINK(_xlfn.XLOOKUP($R37,Lookup_Table!B:B,Lookup_Table!E:E),$R37))","v":""},null,{"$f":"IF($G37=\"\",\"\",_xlfn.XLOOKUP($G37,Lookup_Table!$B:$B,Lookup_Table!C:C))","v":""},{"$f":"IF($G37=\"\",\"\",CONCATENATE(_xlfn.XLOOKUP($G37,Lookup_Table!$B:$B,Lookup_Table!D:D),\" \",$S37))","v":""},{"$f":"IF($G37=\"\",\"\",_xlfn.XLOOKUP($G37,Lookup_Table!$B:$B,Lookup_Table!$A:$A))","v":""},"",null,null,null,null,null,{"$f":"IF(OR($G$8=\"\",$G$8=0,$G$9=\"\",$G$9=0),\"\",2649)","v":""},"for ground posts"]
[null,null,null,{"$f":"IF($G38=\"\",\"\",ROUNDUP((8*G12+16+G8/10)*1.1/100,0))","v":""},null,"",{"$f":"IF($R38=\"\",\"\",HYPERLINK(_xlfn.XLOOKUP($R38,Lookup_Table!B:B,Lookup_Table!E:E),$R38))","v":""},null,{"$f":"IF($G38=\"\",\"\",_xlfn.XLOOKUP($G38,Lookup_Table!$B:$B,Lookup_Table!C:C))","v":""},{"$f":"IF($G38=\"\",\"\",CONCATENATE(_xlfn.XLOOKUP($G38,Lookup_Table!$B:$B,Lookup_Table!D:D),\" \",$S38))","v":""},{"$f":"IF($G38=\"\",\"\",_xlfn.XLOOKUP($G38,Lookup_Table!$B:$B,Lookup_Table!$A:$A))","v":""},"",null,null,null,null,null,{"$f":"IF(OR($G$8=\"\",$G$8=0,$G$9=\"\",$G$9=0),\"\",2405)","v":""},""]
[null,null,null,{"$f":"IF($G39=\"\",\"\",2*G12+12)","v":""},null,"",{"$f":"IF($R39=\"\",\"\",HYPERLINK(_xlfn.XLOOKUP($R39,Lookup_Table!B:B,Lookup_Table!E:E),$R39))","v":""},null,{"$f":"IF($G39=\"\",\"\",_xlfn.XLOOKUP($G39,Lookup_Table!$B:$B,Lookup_Table!C:C))","v":""},{"$f":"IF($G39=\"\",\"\",CONCATENATE(_xlfn.XLOOKUP($G39,Lookup_Table!$B:$B,Lookup_Table!D:D),\" \",$S39))","v":""},{"$f":"IF($G39=\"\",\"\",_xlfn.XLOOKUP($G39,Lookup_Table!$B:$B,Lookup_Table!$A:$A))","v":""},"",null,null,null,null,null,{"$f":"IF(OR($G$8=\"\",$G$8=0,$G$9=\"\",$G$9=0),\"\",\"BB138\")","v":""},""]
[null,null,null,{"$f":"IF($G40=\"\",\"\",4)","v":""},null,"",{"$f":"IF($R40=\"\",\"\",HYPERLINK(_xlfn.XLOOKUP($R40,Lookup_Table!B:B,Lookup_Table!E:E),$R40))","v":""},null,{"$f":"IF($G40=\"\",\"\",_xlfn.XLOOKUP($G40,Lookup_Table!$B:$B,Lookup_Table!C:C))","v":""},{"$f":"IF($G40=\"\",\"\",CONCATENATE(_xlfn.XLOOKUP($G40,Lookup_Table!$B:$B,Lookup_Table!D:D),\" \",$S40))","v":""},{"$f":"IF($G40=\"\",\"\",_xlfn.XLOOKUP($G40,Lookup_Table!$B:$B,Lookup_Table!$A:$A))","v":""},"",null,null,null,null,null,{"$f":"IF(OR($G$8=\"\",$G$8=0,$G$9=\"\",$G$9=0),\"\",\"BB158\")","v":""},""]
{"$rows_left_out":73}