{"text_format":"1","workbook":"xlsx","n_sheets":2,"sheets":["Lookup_Table","Itemized Listing"],"not_rendered":{"charts":0,"images":5,"macros":0,"external_links":0,"defined_names":2,"comments":0,"pivot_tables":0},"unopened":[],"bounds":{"document_bytes":16777216,"sheet_cells":100000,"rows_first":2000,"rows_last":500,"rows_between":2000,"halvings":0,"cell_chars":16384,"cell_head_chars":4096},"cells_cut":0,"cells_raw":0,"read":"whole","date_system":"1900"}

{"sheet":"Lookup_Table","index":0,"n_rows":121,"n_cols":5,"rows_kept":121,"cut":false,"hidden":false,"merged":[]}
["Price","Item #","Table20.Brand","Table20.Description","Table20.Link"]
[120,7000,"Johnny's Selected Seeds","Moveable Caterpillar Tunnel Hoop Bender – 12'","https://www.johnnyseeds.com/tools-supplies/greenhouse-and-tunnel-supplies/benders/moveable-caterpillar-tunnel-hoop-bender-12-quick-hoops-7000.html"]
[99,7033,"Johnny's Selected Seeds","Sidewall Hand Crank","https://www.johnnyseeds.com/tools-supplies/greenhouse-and-tunnel-supplies/hardware-accessories/sidewall-hand-crank-7033.html"]
[9.9499999999999993,7035,"Johnny's Selected Seeds","Snap Clamps for 1-3/8 in. Top-Rail, 10 pack","https://www.johnnyseeds.com/tools-supplies/greenhouse-and-tunnel-supplies/hardware-accessories/snap-clamps-for-1%22-pvc-or-chain-link-fence-top-rail-7035.html"]
[21.97,181697,"Home Depot","10 ft length of 1-3/8\" top rail","https://www.homedepot.com/p/Everbilt-Chain-Link-Fence-1-3-8-in-Diameter-x-10-ft-Long-17-Gauge-Thick-Galvanized-Steel-Top-Rail-Post-328913DPTEB/312373065"]
[8.75,7036,"Johnny's Selected Seeds","Snap Clamps for 3/4\" PVC or 1\" EMT","https://www.johnnyseeds.com/tools-supplies/greenhouse-and-tunnel-supplies/hardware-accessories/snap-clamps-for-3-4%22-pvc-or-1%22-emt-7036.html"]
[28.77,623105,"Home Depot","8 ft length of 1-5/8 in. line post","https://www.homedepot.com/p/Everbilt-1-5-8-in-Dia-x-8-ft-16-Gauge-Galvanized-Steel-Chain-Link-Fence-Line-Post-328923DPTSEB/312373067"]
[2.5,7040,"Johnny's Selected Seeds","4 ft. length of Poly Latch (\"Wiggle\") Wire","https://www.johnnyseeds.com/tools-supplies/greenhouse-and-tunnel-supplies/hardware-accessories/poly-latch-wire-4-7040.html"]
[21.57,320858,"Home Depot","6 ft length of 1-5/8 in. line post","https://www.homedepot.com/p/Everbilt-1-5-8-in-Dia-x-6-ft-16-Gauge-Galvanized-Steel-Chain-Link-Fence-Line-Post-328921DPTSEB/312373050"]
[12,7041,"Johnny's Selected Seeds","8 ft. length of Poly Latch (\"Wiggle\") Channel","https://www.johnnyseeds.com/tools-supplies/greenhouse-and-tunnel-supplies/hardware-accessories/poly-latch-channel-8-7041.html"]
[269,7176,"Johnny's Selected Seeds","Tufflite IV Greenhouse Film, 28 x 65 ft.","https://www.johnnyseeds.com/tools-supplies/greenhouse-and-tunnel-supplies/greenhouse-film/tufflite/tufflite-iv-28-x-65-greenhouse-film-7176.html"]
[0.22,23,"www.boltdepot.com","Hex bolts, Zinc plated steel, 5/16\"-18 x 2\"","https://boltdepot.com/Product-Details?product=23"]
[329,7177,"Johnny's Selected Seeds","Tufflite IV Greenhouse Film, 28 x 100 ft.","https://www.johnnyseeds.com/tools-supplies/greenhouse-and-tunnel-supplies/greenhouse-film/tufflite/tufflite-iv-28-x-100-greenhouse-film-7177.html"]
[0.15,199,"www.boltdepot.com","1/4-20 x 2 in. hex head bolt","https://boltdepot.com/Product-Details?product=199"]
[379,7178,"Johnny's Selected Seeds","Tufflite IV Greenhouse Film, 28 x 125 ft.","https://www.johnnyseeds.com/tools-supplies/greenhouse-and-tunnel-supplies/greenhouse-film/tufflite/tufflite-iv-28-x-125-greenhouse-film-7178.html"]
[0.23,218,"www.boltdepot.com","Hex bolts, Zinc plated steel, 3/8\"-16 x 1\"","https://boltdepot.com/Product-Details?product=218"]
[207,7300,"Johnny's Selected Seeds","Gothic Tunnel Hoop Bender – 14'","https://www.johnnyseeds.com/tools-supplies/greenhouse-and-tunnel-supplies/benders/gothic-tunnel-hoop-bender-14-quick-hoops-7300.html"]
[1.21,859,"www.boltdepot.com","3/8 in. x 5 in. hex tap bolt (fully threaded)","https://boltdepot.com/Product-Details?product=859"]
[491,7301,"Johnny's Selected Seeds","Tufflite IV™ – 32' x 100'","https://www.johnnyseeds.com/tools-supplies/greenhouse-and-tunnel-supplies/greenhouse-film/tufflite/tufflite-iv-32-x-100-greenhouse-film-7301.html"]
[0.68,2032,"www.boltdepot.com","#10 x 4 in. wood screw","https://boltdepot.com/Product-Details?product=2032"]
[440,7302,"Johnny's Selected Seeds","Tufflite IV™ – 32' x 125'","https://www.johnnyseeds.com/tools-supplies/greenhouse-and-tunnel-supplies/greenhouse-film/tufflite/tufflite-iv-32-x-125-greenhouse-film-7302.html"]
[11.73,732050,"Home Depot","1 in. x 8 in. x 16 ft. ledger board ","https://www.homedepot.com/p/1-in-x-8-in-x-16-ft-Ledger-Common-Softwood-Boards-234611/202527794"]
[107.1,9018,"Johnny's Selected Seeds","Quick Hoops High Tunnel Bender","https://www.johnnyseeds.com/tools-supplies/greenhouse-and-tunnel-supplies/benders/high-tunnel-hoop-bender-12-quick-hoops-9018.html"]
[7.0000000000000007E-2,2396,"www.boltdepot.com","Sheet metal screws, Self drilling, Hex washer head, Zinc plated steel, #6 x 1/2\"","https://boltdepot.com/Product-Details?product=2396"]
[8.5,9150,"Johnny's Selected Seeds","Snap Clamps for ¾ in. EMT, 10 pack","https://www.johnnyseeds.com/tools-supplies/greenhouse-and-tunnel-supplies/hardware-accessories/snap-clamps-for-3-4%22-emt-or-1-2%22-pvc-9150.html"]
[5.17,2405,"www.boltdepot.com","#10 x 3/4 in. hex-head self-tapping screws, bag of 100","https://boltdepot.com/Product-Details?product=2405"]
[37.75,9482,"Johnny's Selected Seeds","Ground Post Driver","https://www.johnnyseeds.com/tools-supplies/greenhouse-and-tunnel-supplies/hardware-accessories/ground-post-driver-9482.0.html"]
[3.95,2520,"www.boltdepot.com","#8 x 3/4\" phillips-head self-tapping screws, bag of 100","https://boltdepot.com/Product-Details?product=2520"]
[6.25,9542,"Johnny's Selected Seeds","Cross Connector for 1.315\" x 1.315\" Pipe, pkg of 2","https://www.johnnyseeds.com/tools-supplies/greenhouse-and-tunnel-supplies/hardware-accessories/cross-connectors-2-count-9542.html"]
[0.12,2624,"www.boltdepot.com","1/4 -20 nylock lock nut","https://boltdepot.com/Product-Details?product=2624"]
[37.950000000000003,9604,"Johnny's Selected Seeds","#9 Wire, Coil of 60 ft.","https://www.johnnyseeds.com/tools-supplies/row-covers-and-accessories/supports-anchors/coiled-%239-support-wire-60-9604.html"]
[0.06,2648,"www.boltdepot.com","1/4 in. hex nut","https://boltdepot.com/Product-Details?product=2648"]
[186,9630,"Johnny's Selected Seeds","Tufflite IV™ – 20' x 65'","https://www.johnnyseeds.com/tools-supplies/greenhouse-and-tunnel-supplies/greenhouse-film/tufflite/tufflite-iv-20-x-65-greenhouse-film-9630.html"]
[345,9644,"Johnny's Selected Seeds","Tufflite IV™ – 20' x 125'","https://www.johnnyseeds.com/tools-supplies/greenhouse-and-tunnel-supplies/greenhouse-film/tufflite/tufflite-iv-20-x-125-greenhouse-film-9644.html"]
[219,9645,"Johnny's Selected Seeds","Tufflite IV Greenhouse Film, 24 x 65 ft.","https://www.johnnyseeds.com/tools-supplies/greenhouse-and-tunnel-supplies/greenhouse-film/tufflite/tufflite-iv-24-x-65-greenhouse-film-9645.html"]
[335.7,9701,"Johnny's Selected Seeds","Tufflite IV Greenhouse Film, 24 x 125 ft.","https://www.johnnyseeds.com/tools-supplies/greenhouse-and-tunnel-supplies/greenhouse-film/tufflite/tufflite-iv-24-x-125-greenhouse-film-9701.html"]
[79,9723,"Johnny's Selected Seeds","Anchoring Pins™ Fabric Staples – 500 Count","https://www.johnnyseeds.com/tools-supplies/row-covers-and-accessories/supports-anchors/anchoring-pins-fabric-staples-500-count-9723.html"]
[225,9724,"Johnny's Selected Seeds","Pro 5 Weed Barrier – 4' x 250'","https://www.johnnyseeds.com/tools-supplies/mulches-and-weed-barrier/fabric-mulch/pro-5-weed-barrier-4-x-250-landscape-fabric-9724.html"]
[123,9725,"Johnny's Selected Seeds","#9 Wire, Coil of 550 ft.","https://www.johnnyseeds.com/tools-supplies/row-covers-and-accessories/supports-anchors/coiled-%239-support-wire-550-9725.html"]
[0.09,2649,"www.boltdepot.com","5/16\"-18 hex nut","https://boltdepot.com/Product-Details?product=2649"]
{"$rows_left_out":82}
{"sheet":"Itemized Listing","index":1,"n_rows":94,"n_cols":16,"rows_kept":94,"cut":false,"hidden":false,"merged":[[85,3,85,4],[84,3,84,4],[86,3,86,4],[54,3,54,4],[55,3,55,4],[56,3,56,4],[58,3,58,4],[59,3,59,4],[79,3,79,4],[57,3,57,4],[69,3,69,4],[70,3,70,4],[83,3,83,4],[73,1,73,5],[62,3,62,4],[63,3,63,4],[64,3,64,4],[65,3,65,4],[73,6,73,7],[82,1,82,5],[82,6,82,7],[76,3,76,4],[77,3,77,4],[78,3,78,4],[80,3,80,4],[81,3,81,4],[75,3,75,4],[74,3,74,4],[71,3,71,4],[67,3,67,4],[68,3,68,4],[52,6,52,7],[52,1,52,5],[61,6,61,7],[45,3,45,4],[23,6,24,6],[28,6,28,7],[48,3,48,4],[53,3,53,4],[60,3,60,4],[35,3,35,4],[36,3,36,4],[33,3,33,4],[34,3,34,4],[39,3,39,4],[51,3,51,4],[47,6,47,7],[87,3,87,4],[49,3,49,4],[50,3,50,4],[72,3,72,4],[29,3,29,4],[42,3,42,4],[41,3,41,4],[44,3,44,4],[30,3,30,4],[31,1,31,5],[47,1,47,5],[40,3,40,4],[43,3,43,4],[46,3,46,4],[61,1,61,5],[66,3,66,4],[37,3,37,4],[38,3,38,4],[16,1,16,4],[15,1,15,4],[21,1,21,5],[20,1,20,5],[19,1,19,5],[17,1,17,4],[19,6,21,6],[15,6,17,6],[27,3,27,4],[32,3,32,4],[28,1,28,5],[93,0,93,10],[92,0,92,10],[31,6,31,7],[1,1,1,9],[13,3,13,4],[4,1,4,8],[2,1,2,8],[8,1,8,2],[10,1,10,2],[3,1,3,8],[6,1,6,4],[9,1,9,2],[13,1,13,2],[12,1,12,2],[12,5,12,8],[12,3,12,4]]}
[]
[]
[null,"Quick Hoops Stationary Traditional 12-ft-Wide High Tunnel Calculator"]
[null,"***Fill in the items below and the calculator will do the rest.***"]
[null,"All prices are estimations. Prices will vary and do not include shipping costs or tax. Vendors and part#'s for pipe and other accessories are provided for your convenience only. Johnny's has no affiliation with these companies, other than purchasing these supplies from them and finding their prices competitive."]
[]
[null,"Dimensions, Spec's",null,null,null,null,null,"Square Feet",{"$f":"12*D9","v":0}]
[]
[null,"Length",null,null,"feet",null,null,"Cost / Sq. Ft.",{"$f":"IFERROR(I90/I7,0)","v":0},null,null,null,null,null,{"$f":"_xlfn._xlws.FILTER(_xlfn.SEQUENCE(3,,4),MOD($D$9/_xlfn.SEQUENCE(3,,4),1)=0=TRUE,\"Length must be divisable by 4,5 or 6\")","v":4}]
[null,"Spacing",null,null,"feet",null,null,null,null,null,null,null,null,null,5]
[null,"Grnd Posts",null,null,"feet",null,null,null,null,null,null,null,null,null,6]
[]
[null,"# Segments",null,{"$f":"IFERROR(D9/D10,\"\")","v":""},null,{"$f":"IF(D11=3,\"\",IF(D11=4,\"\", IF(D11=\"\",\"\",\"***Please enter only 3 or 4 for Ground Post Height.***\")))","v":""}]
[null,"# Bows",null,{"$f":"IF($D$13=\"\",\"\",D13+1)","v":""}]
[]
[null,{"$f":"IF($A$17=1,\"x\",\"\")","v":"x"}]
[1,{"$f":"IF($A$17=2,\"x\",\"\")","v":""},null,null,null,null,null,null,null,null,null,null," "]
[null,{"$f":"IF($A$17=3,\"x\",\"\")","v":""}]
[]
[null,{"$f":"IF($A$21=1,\"x\",\"\")","v":"x"}]
[1,{"$f":"IF($A$21=3,\"x\",\"\")","v":""}]
[null,{"$f":"IF($A$21=2,\"x\",\"\")","v":""}]
[]
[null,null," # Cable Purlins for Trellising",null,null,null,{"$f":"IF(B24=\"x\",\"Enter the quantity of Cable Purlins you would like\n(e.g.: 1, 2, or 3), or select No Purlins.\", IF(AND(B24>0, B25=FALSE),\"\", IF(AND(B24=\"\",B25=TRUE),\"\", \"Enter the quantity of Cable Purlins you would like\n(e.g.: 1, 2, or 3), or select No Purlins.\")))","v":"Enter the quantity of Cable Purlins you would like\n(e.g.: 1, 2, or 3), or select No Purlins."}]
[null,false," No Purlins"]
[]
[]
[null,"Qty","Unit","Part#",null,"Vendor","Description","Price","Ext"]
[null,"Special Tools",null,null,null,null,"Subtotal:",null,{"$f":"SUM(I30:I31)","v":0}]
[null,{"$f":"IF($I$7=0,\"\",1)","v":""},{"$f":"IF($I$7=0,\"\",\"each\")","v":""},{"$f":"IF($O30=\"\",\"\",HYPERLINK(_xlfn.XLOOKUP($O30,Lookup_Table!$B$2:$B$121,Lookup_Table!$E$2:$E$121),$O30))","v":""},null,{"$f":"IF(D30=\"\",\"\",_xlfn.XLOOKUP($D30,Lookup_Table[Item '#],Lookup_Table[Table20.Brand]))","v":""},{"$f":"IF(D30=\"\",\"\",_xlfn.XLOOKUP($D30,Lookup_Table[Item '#],Lookup_Table[Table20.Description]))","v":""},{"$f":"IF(D30=\"\",\"\",_xlfn.XLOOKUP($D30,Lookup_Table[Item '#],Lookup_Table[Price]))","v":""},{"$f":"IF(H30=\"\",\"\",B30*H30)","v":""},null,null,null,null,null,{"$f":"IF(I7=0,\"\",9018)","v":""}]
[null,{"$f":"IF($I$7=0,\"\",1)","v":""},{"$f":"IF($I$7=0,\"\",\"each\")","v":""},{"$f":"IF($O31=\"\",\"\",HYPERLINK(_xlfn.XLOOKUP($O31,Lookup_Table!$B$2:$B$121,Lookup_Table!$E$2:$E$121),$O31))","v":""},null,{"$f":"IF(D31=\"\",\"\",_xlfn.XLOOKUP($D31,Lookup_Table[Item '#],Lookup_Table[Table20.Brand]))","v":""},{"$f":"IF(D31=\"\",\"\",_xlfn.XLOOKUP($D31,Lookup_Table[Item '#],Lookup_Table[Table20.Description]))","v":""},{"$f":"IF(D31=\"\",\"\",_xlfn.XLOOKUP($D31,Lookup_Table[Item '#],Lookup_Table[Price]))","v":""},{"$f":"IF(B31=\"\",\"\", B31*H31)","v":""},null,null,null,null,null,{"$f":"IF($I$7=0,\"\",9482)","v":""}]
[null,"Frame Components",null,null,null,null,"Subtotal:",null,{"$f":"SUM(I33:I47)","v":0}]
[null,{"$f":"IF(OR($I$7=0,$D$10=\"\"),\"\",D9*2/D10+2)","v":""},{"$f":"IF(B33=\"\",\"\",\"each\")","v":""},{"$f":"IF($O33=\"\",\"\",HYPERLINK(_xlfn.XLOOKUP($O33,Lookup_Table!$B$2:$B$121,Lookup_Table!$E$2:$E$121),$O33))","v":""},null,{"$f":"IF(D33=\"\",\"\",_xlfn.XLOOKUP($D33,Lookup_Table[Item '#],Lookup_Table[Table20.Brand]))","v":""},{"$f":"IF(D33=\"\",\"\",_xlfn.XLOOKUP($D33,Lookup_Table[Item '#],Lookup_Table[Table20.Description]))","v":""},{"$f":"IF(D33=\"\",\"\",_xlfn.XLOOKUP($D33,Lookup_Table[Item '#],Lookup_Table[Price]))","v":""},{"$f":"IF(B33=\"\",\"\", B33*H33)","v":""},null,null,null,null,null,{"$f":"IF(OR($I$7=0,$D$10=\"\"),\"\",181697)","v":""}]
[null,{"$f":"IF($I$7=0,\"\",IF(B16=\"x\",ROUNDUP(D9/10+0.5,0),ROUNDUP(D9/10,0)))","v":""},{"$f":"IF(B34=\"\",\"\",\"each\")","v":""},{"$f":"IF($O34=\"\",\"\",HYPERLINK(_xlfn.XLOOKUP($O34,Lookup_Table!$B$2:$B$121,Lookup_Table!$E$2:$E$121),$O34))","v":""},null,{"$f":"IF(D34=\"\",\"\",_xlfn.XLOOKUP($D34,Lookup_Table[Item '#],Lookup_Table[Table20.Brand]))","v":""},{"$f":"IF(D34=\"\",\"\",_xlfn.XLOOKUP($D34,Lookup_Table[Item '#],Lookup_Table[Table20.Description]))","v":""},{"$f":"IF(D34=\"\",\"\",_xlfn.XLOOKUP($D34,Lookup_Table[Item '#],Lookup_Table[Price]))","v":""},"",null,null,null,null,null,{"$f":"IF($I$7=0,\"\",181697)","v":""}]
[null,{"$f":"IF(OR($I$7=0,$D$10=\"\",$D$11=\"\"),\"\",B33/2)","v":""},"",{"$f":"IF($O35=\"\",\"\",HYPERLINK(_xlfn.XLOOKUP($O35,Lookup_Table!$B$2:$B$121,Lookup_Table!$E$2:$E$121),$O35))","v":""},null,{"$f":"IF(D35=\"\",\"\",_xlfn.XLOOKUP($D35,Lookup_Table[Item '#],Lookup_Table[Table20.Brand]))","v":""},{"$f":"IF(D35=\"\",\"\",_xlfn.XLOOKUP($D35,Lookup_Table[Item '#],Lookup_Table[Table20.Description]))","v":""},{"$f":"IF(D35=\"\",\"\",_xlfn.XLOOKUP($D35,Lookup_Table[Item '#],Lookup_Table[Price]))","v":""},"",null,null,null,null,null,{"$f":"IF($I$7=0,\"\",IF(D11=3,320858, IF(D11=4,623105,\"\")))","v":""}]
[null,{"$f":"IF($I$7=0,\"\",ROUNDUP(D14/2,0))","v":""},"",{"$f":"IF($O36=\"\",\"\",HYPERLINK(_xlfn.XLOOKUP($O36,Lookup_Table!$B$2:$B$121,Lookup_Table!$E$2:$E$121),$O36))","v":""},null,{"$f":"IF(D36=\"\",\"\",_xlfn.XLOOKUP($D36,Lookup_Table[Item '#],Lookup_Table[Table20.Brand]))","v":""},{"$f":"IF(D36=\"\",\"\",_xlfn.XLOOKUP($D36,Lookup_Table[Item '#],Lookup_Table[Table20.Description]))","v":""},{"$f":"IF(D36=\"\",\"\",_xlfn.XLOOKUP($D36,Lookup_Table[Item '#],Lookup_Table[Price]))","v":""},"",null,null,null,null,null,{"$f":"IF($I$7=0,\"\",9542)","v":""}]
[null,{"$f":"IF($I$7=0,\"\",ROUNDUP(2.1*D14/100,0))","v":""},"",{"$f":"IF($O37=\"\",\"\",HYPERLINK(_xlfn.XLOOKUP($O37,Lookup_Table!$B$2:$B$121,Lookup_Table!$E$2:$E$121),$O37))","v":""},null,{"$f":"IF(D37=\"\",\"\",_xlfn.XLOOKUP($D37,Lookup_Table[Item '#],Lookup_Table[Table20.Brand]))","v":""},{"$f":"IF(D37=\"\",\"\",_xlfn.XLOOKUP($D37,Lookup_Table[Item '#],Lookup_Table[Table20.Description]))","v":""},{"$f":"IF(D37=\"\",\"\",_xlfn.XLOOKUP($D37,Lookup_Table[Item '#],Lookup_Table[Price]))","v":""},"",null,null,null,null,null,{"$f":"IF($I$7=0,\"\",2405)","v":""}]
[null,{"$f":"IF($I$7=0,\"\",2*D14)","v":""},"",{"$f":"IF($O38=\"\",\"\",HYPERLINK(_xlfn.XLOOKUP($O38,Lookup_Table!$B$2:$B$121,Lookup_Table!$E$2:$E$121),$O38))","v":""},null,{"$f":"IF(D38=\"\",\"\",_xlfn.XLOOKUP($D38,Lookup_Table[Item '#],Lookup_Table[Table20.Brand]))","v":""},{"$f":"IF(D38=\"\",\"\",_xlfn.XLOOKUP($D38,Lookup_Table[Item '#],Lookup_Table[Table20.Description]))","v":""},{"$f":"IF(D38=\"\",\"\",_xlfn.XLOOKUP($D38,Lookup_Table[Item '#],Lookup_Table[Price]))","v":""},"",null,null,null,null,null,{"$f":"IF($I$7=0,\"\",12529)","v":""}]
[null,{"$f":"IF($I$7=0,\"\",B38)","v":""},"",{"$f":"IF($O39=\"\",\"\",HYPERLINK(_xlfn.XLOOKUP($O39,Lookup_Table!$B$2:$B$121,Lookup_Table!$E$2:$E$121),$O39))","v":""},null,{"$f":"IF(D39=\"\",\"\",_xlfn.XLOOKUP($D39,Lookup_Table[Item '#],Lookup_Table[Table20.Brand]))","v":""},{"$f":"IF(D39=\"\",\"\",_xlfn.XLOOKUP($D39,Lookup_Table[Item '#],Lookup_Table[Table20.Description]))","v":""},{"$f":"IF(D39=\"\",\"\",_xlfn.XLOOKUP($D39,Lookup_Table[Item '#],Lookup_Table[Price]))","v":""},"",null,null,null,null,null,{"$f":"IF($I$7=0,\"\",2649)","v":""}]
[null,{"$f":"IF($I$7=0,\"\",B38)","v":""},"",{"$f":"IF($O40=\"\",\"\",HYPERLINK(_xlfn.XLOOKUP($O40,Lookup_Table!$B$2:$B$121,Lookup_Table!$E$2:$E$121),$O40))","v":""},null,{"$f":"IF(D40=\"\",\"\",_xlfn.XLOOKUP($D40,Lookup_Table[Item '#],Lookup_Table[Table20.Brand]))","v":""},{"$f":"IF(D40=\"\",\"\",_xlfn.XLOOKUP($D40,Lookup_Table[Item '#],Lookup_Table[Table20.Description]))","v":""},{"$f":"IF(D40=\"\",\"\",_xlfn.XLOOKUP($D40,Lookup_Table[Item '#],Lookup_Table[Price]))","v":""},"",null,null,null,null,null,{"$f":"IF($I$7=0,\"\",3025)","v":""}]
{"$rows_left_out":54}